Toolchain build for cp2k 3.0: elpa-2015.11.001_mt compilation fails

Matthias May matthi... at gmail.com
Thu Jan 14 15:55:04 CET 2016


Hi,

I am trying to build the cp2k toolchain on an openSUSE 13.1 system. When 
the toolchain script comes to building elpa, however, it fails. This also 
happens if I use the newest version r1605 of install_cp2k_toolchain.sh, see 
the attached 'make.log' for the 'elpa-2015.11.001_mt' directory. Does 
anyone have an idea how to solve this problem? Help greatly appreciated.

Best,

Matthias
-------------- next part --------------
An HTML attachment was scrubbed...
URL: <https://lists.cp2k.org/archives/cp2k-user/attachments/20160114/88ab81e0/attachment.html>
-------------- next part --------------
make  all-am
make[1]: Entering directory '/oc/home/user/build-files/cp2k-3.0/tools/toolchain/build/elpa-2015.11.001_mt'
fdep/fortran_dependencies.mk:67: /home/user/build-files/cp2k-3.0/tools/toolchain/build/elpa-2015.11.001_mt/.fortran_dependencies/dependencies.mk: No such file or directory
  F90 USE  [elpa1_test_real_openmp] test/fortran_test_programs/test_real.F90
  F90 USE  [elpa1_test_real_openmp] test/shared_sources/util.F90
  F90 USE  [elpa1_test_real_openmp] test/shared_sources/check_correctnes.F90
  F90 USE  [elpa1_test_real_openmp] test/shared_sources/read_input_parameters.F90
  F90 USE  [elpa1_test_real_openmp] test/shared_sources/setup_mpi.F90
  F90 USE  [elpa1_test_real_openmp] test/shared_sources/blacs_infrastructure.F90
  F90 MOD  [elpa1_test_real_openmp] test/fortran_test_programs/test_real.F90
  F90 USE  [elpa1_test_real_openmp] test/shared_sources/prepare_matrix.F90
  F90 MOD  [elpa1_test_real_openmp] test/shared_sources/read_input_parameters.F90
  F90 MOD  [elpa1_test_real_openmp] test/shared_sources/check_correctnes.F90
  F90 MOD  [elpa1_test_real_openmp] test/shared_sources/util.F90
  F90 MOD  [elpa1_test_real_openmp] test/shared_sources/setup_mpi.F90
  F90 MOD  [elpa1_test_real_openmp] test/shared_sources/blacs_infrastructure.F90
  F90 MOD  [elpa1_test_real_openmp] test/shared_sources/prepare_matrix.F90
  F90 USE  [elpa1_test_complex_openmp] test/fortran_test_programs/test_complex.F90
  F90 USE  [elpa1_test_complex_openmp] test/shared_sources/util.F90
  F90 USE  [elpa1_test_complex_openmp] test/shared_sources/read_input_parameters.F90
  F90 USE  [elpa1_test_complex_openmp] test/shared_sources/check_correctnes.F90
  F90 USE  [elpa1_test_complex_openmp] test/shared_sources/blacs_infrastructure.F90
  F90 USE  [elpa1_test_complex_openmp] test/shared_sources/setup_mpi.F90
  F90 USE  [elpa1_test_complex_openmp] test/shared_sources/prepare_matrix.F90
  F90 MOD  [elpa1_test_complex_openmp] test/fortran_test_programs/test_complex.F90
  F90 MOD  [elpa1_test_complex_openmp] test/shared_sources/util.F90
  F90 MOD  [elpa1_test_complex_openmp] test/shared_sources/read_input_parameters.F90
  F90 MOD  [elpa1_test_complex_openmp] test/shared_sources/prepare_matrix.F90
  F90 MOD  [elpa1_test_complex_openmp] test/shared_sources/check_correctnes.F90
  F90 MOD  [elpa1_test_complex_openmp] test/shared_sources/blacs_infrastructure.F90
  F90 USE  [elpa2_test_real_openmp] test/fortran_test_programs/test_real2.F90
  F90 USE  [elpa2_test_real_openmp] test/shared_sources/util.F90
  F90 MOD  [elpa1_test_complex_openmp] test/shared_sources/setup_mpi.F90
  F90 USE  [elpa2_test_real_openmp] test/shared_sources/read_input_parameters.F90
  F90 USE  [elpa2_test_real_openmp] test/shared_sources/setup_mpi.F90
  F90 USE  [elpa2_test_real_openmp] test/shared_sources/check_correctnes.F90
  F90 USE  [elpa2_test_real_openmp] test/shared_sources/prepare_matrix.F90
  F90 USE  [elpa2_test_real_openmp] test/shared_sources/blacs_infrastructure.F90
  F90 MOD  [elpa2_test_real_openmp] test/fortran_test_programs/test_real2.F90
  F90 MOD  [elpa2_test_real_openmp] test/shared_sources/util.F90
  F90 MOD  [elpa2_test_real_openmp] test/shared_sources/check_correctnes.F90
  F90 MOD  [elpa2_test_real_openmp] test/shared_sources/setup_mpi.F90
  F90 MOD  [elpa2_test_real_openmp] test/shared_sources/read_input_parameters.F90
  F90 MOD  [elpa2_test_real_openmp] test/shared_sources/blacs_infrastructure.F90
  F90 USE  [elpa2_test_complex_openmp] test/shared_sources/util.F90
  F90 USE  [elpa2_test_complex_openmp] test/shared_sources/read_input_parameters.F90
  F90 USE  [elpa2_test_complex_openmp] test/fortran_test_programs/test_complex2.F90
  F90 USE  [elpa2_test_complex_openmp] test/shared_sources/check_correctnes.F90
  F90 MOD  [elpa2_test_real_openmp] test/shared_sources/prepare_matrix.F90
  F90 USE  [elpa2_test_complex_openmp] test/shared_sources/prepare_matrix.F90
  F90 USE  [elpa2_test_complex_openmp] test/shared_sources/setup_mpi.F90
  F90 USE  [elpa2_test_complex_openmp] test/shared_sources/blacs_infrastructure.F90
  F90 MOD  [elpa2_test_complex_openmp] test/fortran_test_programs/test_complex2.F90
  F90 MOD  [elpa2_test_complex_openmp] test/shared_sources/util.F90
  F90 MOD  [elpa2_test_complex_openmp] test/shared_sources/read_input_parameters.F90
  F90 MOD  [elpa2_test_complex_openmp] test/shared_sources/check_correctnes.F90
  F90 MOD  [elpa2_test_complex_openmp] test/shared_sources/blacs_infrastructure.F90
  F90 MOD  [elpa2_test_complex_openmp] test/shared_sources/prepare_matrix.F90
  F90 MOD  [elpa2_test_complex_openmp] test/shared_sources/setup_mpi.F90
  F90 USE  [elpa2_print_kernels_openmp] src/print_available_elpa2_kernels.F90
  F90 USE  [elpa2_print_kernels_openmp] test/shared_sources/read_input_parameters.F90
  F90 USE  [elpa2_print_kernels_openmp] test/shared_sources/util.F90
  F90 USE  [elpa2_print_kernels_openmp] test/shared_sources/check_correctnes.F90
  F90 USE  [elpa2_print_kernels_openmp] test/shared_sources/setup_mpi.F90
  F90 MOD  [elpa2_print_kernels_openmp] src/print_available_elpa2_kernels.F90
  F90 USE  [elpa2_print_kernels_openmp] test/shared_sources/blacs_infrastructure.F90
  F90 USE  [elpa2_print_kernels_openmp] test/shared_sources/prepare_matrix.F90
  F90 MOD  [elpa2_print_kernels_openmp] test/shared_sources/read_input_parameters.F90
  F90 MOD  [elpa2_print_kernels_openmp] test/shared_sources/setup_mpi.F90
  F90 MOD  [elpa2_print_kernels_openmp] test/shared_sources/util.F90
  F90 MOD  [elpa2_print_kernels_openmp] test/shared_sources/check_correctnes.F90
  F90 MOD  [elpa2_print_kernels_openmp] test/shared_sources/prepare_matrix.F90
  F90 USE  [elpa2_test_real_default_kernel_openmp] test/fortran_test_programs/test_real2_default_kernel.F90
  F90 USE  [elpa2_test_real_default_kernel_openmp] test/shared_sources/util.F90
  F90 MOD  [elpa2_print_kernels_openmp] test/shared_sources/blacs_infrastructure.F90
  F90 USE  [elpa2_test_real_default_kernel_openmp] test/shared_sources/check_correctnes.F90
  F90 USE  [elpa2_test_real_default_kernel_openmp] test/shared_sources/blacs_infrastructure.F90
  F90 USE  [elpa2_test_real_default_kernel_openmp] test/shared_sources/setup_mpi.F90
  F90 USE  [elpa2_test_real_default_kernel_openmp] test/shared_sources/read_input_parameters.F90
  F90 USE  [elpa2_test_real_default_kernel_openmp] test/shared_sources/prepare_matrix.F90
  F90 MOD  [elpa2_test_real_default_kernel_openmp] test/fortran_test_programs/test_real2_default_kernel.F90
  F90 MOD  [elpa2_test_real_default_kernel_openmp] test/shared_sources/read_input_parameters.F90
  F90 MOD  [elpa2_test_real_default_kernel_openmp] test/shared_sources/setup_mpi.F90
  F90 MOD  [elpa2_test_real_default_kernel_openmp] test/shared_sources/blacs_infrastructure.F90
  F90 USE  [elpa2_test_real_default_kernel_qr_decomposition_openmp] test/fortran_test_programs/test_real2_default_kernel_qr_decomposition.F90
  F90 MOD  [elpa2_test_real_default_kernel_openmp] test/shared_sources/prepare_matrix.F90
  F90 MOD  [elpa2_test_real_default_kernel_openmp] test/shared_sources/util.F90
  F90 MOD  [elpa2_test_real_default_kernel_openmp] test/shared_sources/check_correctnes.F90
  F90 USE  [elpa2_test_real_default_kernel_qr_decomposition_openmp] test/shared_sources/util.F90
  F90 USE  [elpa2_test_real_default_kernel_qr_decomposition_openmp] test/shared_sources/read_input_parameters.F90
  F90 USE  [elpa2_test_real_default_kernel_qr_decomposition_openmp] test/shared_sources/check_correctnes.F90
  F90 USE  [elpa2_test_real_default_kernel_qr_decomposition_openmp] test/shared_sources/setup_mpi.F90
  F90 USE  [elpa2_test_real_default_kernel_qr_decomposition_openmp] test/shared_sources/blacs_infrastructure.F90
  F90 USE  [elpa2_test_real_default_kernel_qr_decomposition_openmp] test/shared_sources/prepare_matrix.F90
  F90 MOD  [elpa2_test_real_default_kernel_qr_decomposition_openmp] test/fortran_test_programs/test_real2_default_kernel_qr_decomposition.F90
  F90 MOD  [elpa2_test_real_default_kernel_qr_decomposition_openmp] test/shared_sources/util.F90
  F90 MOD  [elpa2_test_real_default_kernel_qr_decomposition_openmp] test/shared_sources/read_input_parameters.F90
  F90 MOD  [elpa2_test_real_default_kernel_qr_decomposition_openmp] test/shared_sources/check_correctnes.F90
  F90 MOD  [elpa2_test_real_default_kernel_qr_decomposition_openmp] test/shared_sources/setup_mpi.F90
  F90 MOD  [elpa2_test_real_default_kernel_qr_decomposition_openmp] test/shared_sources/blacs_infrastructure.F90
  F90 USE  [elpa2_test_complex_default_kernel_openmp] test/fortran_test_programs/test_complex2_default_kernel.F90
  F90 MOD  [elpa2_test_real_default_kernel_qr_decomposition_openmp] test/shared_sources/prepare_matrix.F90
  F90 USE  [elpa2_test_complex_default_kernel_openmp] test/shared_sources/util.F90
  F90 USE  [elpa2_test_complex_default_kernel_openmp] test/shared_sources/read_input_parameters.F90
  F90 USE  [elpa2_test_complex_default_kernel_openmp] test/shared_sources/check_correctnes.F90
  F90 USE  [elpa2_test_complex_default_kernel_openmp] test/shared_sources/setup_mpi.F90
  F90 USE  [elpa2_test_complex_default_kernel_openmp] test/shared_sources/blacs_infrastructure.F90
  F90 USE  [elpa2_test_complex_default_kernel_openmp] test/shared_sources/prepare_matrix.F90
  F90 MOD  [elpa2_test_complex_default_kernel_openmp] test/fortran_test_programs/test_complex2_default_kernel.F90
  F90 MOD  [elpa2_test_complex_default_kernel_openmp] test/shared_sources/util.F90
  F90 MOD  [elpa2_test_complex_default_kernel_openmp] test/shared_sources/read_input_parameters.F90
  F90 MOD  [elpa2_test_complex_default_kernel_openmp] test/shared_sources/check_correctnes.F90
  F90 MOD  [elpa2_test_complex_default_kernel_openmp] test/shared_sources/setup_mpi.F90
  F90 MOD  [elpa2_test_complex_default_kernel_openmp] test/shared_sources/blacs_infrastructure.F90
  F90 USE  [elpa2_test_real_choose_kernel_with_api_openmp] test/fortran_test_programs/test_real2_choose_kernel_with_api.F90
  F90 MOD  [elpa2_test_complex_default_kernel_openmp] test/shared_sources/prepare_matrix.F90
  F90 USE  [elpa2_test_real_choose_kernel_with_api_openmp] test/shared_sources/util.F90
  F90 USE  [elpa2_test_real_choose_kernel_with_api_openmp] test/shared_sources/check_correctnes.F90
  F90 USE  [elpa2_test_real_choose_kernel_with_api_openmp] test/shared_sources/read_input_parameters.F90
  F90 USE  [elpa2_test_real_choose_kernel_with_api_openmp] test/shared_sources/setup_mpi.F90
  F90 USE  [elpa2_test_real_choose_kernel_with_api_openmp] test/shared_sources/blacs_infrastructure.F90
  F90 MOD  [elpa2_test_real_choose_kernel_with_api_openmp] test/fortran_test_programs/test_real2_choose_kernel_with_api.F90
  F90 USE  [elpa2_test_real_choose_kernel_with_api_openmp] test/shared_sources/prepare_matrix.F90
  F90 MOD  [elpa2_test_real_choose_kernel_with_api_openmp] test/shared_sources/util.F90
  F90 MOD  [elpa2_test_real_choose_kernel_with_api_openmp] test/shared_sources/read_input_parameters.F90
  F90 MOD  [elpa2_test_real_choose_kernel_with_api_openmp] test/shared_sources/check_correctnes.F90
  F90 MOD  [elpa2_test_real_choose_kernel_with_api_openmp] test/shared_sources/setup_mpi.F90
  F90 MOD  [elpa2_test_real_choose_kernel_with_api_openmp] test/shared_sources/blacs_infrastructure.F90
  F90 MOD  [elpa2_test_real_choose_kernel_with_api_openmp] test/shared_sources/prepare_matrix.F90
  F90 USE  [elpa2_test_complex_choose_kernel_with_api_openmp] test/fortran_test_programs/test_complex2_choose_kernel_with_api.F90
  F90 USE  [elpa2_test_complex_choose_kernel_with_api_openmp] test/shared_sources/util.F90
  F90 USE  [elpa2_test_complex_choose_kernel_with_api_openmp] test/shared_sources/read_input_parameters.F90
  F90 USE  [elpa2_test_complex_choose_kernel_with_api_openmp] test/shared_sources/check_correctnes.F90
  F90 USE  [elpa2_test_complex_choose_kernel_with_api_openmp] test/shared_sources/blacs_infrastructure.F90
  F90 USE  [elpa2_test_complex_choose_kernel_with_api_openmp] test/shared_sources/setup_mpi.F90
  F90 USE  [elpa2_test_complex_choose_kernel_with_api_openmp] test/shared_sources/prepare_matrix.F90
  F90 MOD  [elpa2_test_complex_choose_kernel_with_api_openmp] test/fortran_test_programs/test_complex2_choose_kernel_with_api.F90
  F90 MOD  [elpa2_test_complex_choose_kernel_with_api_openmp] test/shared_sources/util.F90
  F90 MOD  [elpa2_test_complex_choose_kernel_with_api_openmp] test/shared_sources/check_correctnes.F90
  F90 MOD  [elpa2_test_complex_choose_kernel_with_api_openmp] test/shared_sources/read_input_parameters.F90
  F90 MOD  [elpa2_test_complex_choose_kernel_with_api_openmp] test/shared_sources/setup_mpi.F90
  F90 MOD  [elpa2_test_complex_choose_kernel_with_api_openmp] test/shared_sources/blacs_infrastructure.F90
  F90 MOD  [elpa2_test_complex_choose_kernel_with_api_openmp] test/shared_sources/prepare_matrix.F90
  F90 USE  [elpa1_test_real_c_version_openmp] test/shared_sources/read_input_parameters.F90
  F90 USE  [elpa1_test_real_c_version_openmp] test/shared_sources/util.F90
  F90 USE  [elpa1_test_real_c_version_openmp] test/shared_sources/check_correctnes.F90
  F90 USE  [elpa1_test_real_c_version_openmp] test/shared_sources/setup_mpi.F90
  F90 USE  [elpa1_test_real_c_version_openmp] test/shared_sources/blacs_infrastructure.F90
  F90 MOD  [elpa1_test_real_c_version_openmp] test/shared_sources/util.F90
  F90 MOD  [elpa1_test_real_c_version_openmp] test/shared_sources/read_input_parameters.F90
  F90 USE  [elpa1_test_real_c_version_openmp] test/shared_sources/prepare_matrix.F90
  F90 MOD  [elpa1_test_real_c_version_openmp] test/shared_sources/check_correctnes.F90
  F90 MOD  [elpa1_test_real_c_version_openmp] test/shared_sources/setup_mpi.F90
  F90 MOD  [elpa1_test_real_c_version_openmp] test/shared_sources/blacs_infrastructure.F90
  F90 MOD  [elpa1_test_real_c_version_openmp] test/shared_sources/prepare_matrix.F90
  F90 USE  [elpa1_test_complex_c_version_openmp] test/shared_sources/util.F90
  F90 USE  [elpa1_test_complex_c_version_openmp] test/shared_sources/read_input_parameters.F90
  F90 USE  [elpa1_test_complex_c_version_openmp] test/shared_sources/check_correctnes.F90
  F90 USE  [elpa1_test_complex_c_version_openmp] test/shared_sources/setup_mpi.F90
  F90 USE  [elpa1_test_complex_c_version_openmp] test/shared_sources/blacs_infrastructure.F90
  F90 USE  [elpa1_test_complex_c_version_openmp] test/shared_sources/prepare_matrix.F90
  F90 MOD  [elpa1_test_complex_c_version_openmp] test/shared_sources/read_input_parameters.F90
  F90 MOD  [elpa1_test_complex_c_version_openmp] test/shared_sources/util.F90
  F90 MOD  [elpa1_test_complex_c_version_openmp] test/shared_sources/check_correctnes.F90
  F90 MOD  [elpa1_test_complex_c_version_openmp] test/shared_sources/blacs_infrastructure.F90
  F90 MOD  [elpa1_test_complex_c_version_openmp] test/shared_sources/prepare_matrix.F90
  F90 MOD  [elpa1_test_complex_c_version_openmp] test/shared_sources/setup_mpi.F90
  F90 USE  [elpa2_test_real_c_version_openmp] test/shared_sources/util.F90
  F90 USE  [elpa2_test_real_c_version_openmp] test/shared_sources/read_input_parameters.F90
  F90 USE  [elpa2_test_real_c_version_openmp] test/shared_sources/check_correctnes.F90
  F90 USE  [elpa2_test_real_c_version_openmp] test/shared_sources/setup_mpi.F90
  F90 USE  [elpa2_test_real_c_version_openmp] test/shared_sources/blacs_infrastructure.F90
  F90 USE  [elpa2_test_real_c_version_openmp] test/shared_sources/prepare_matrix.F90
  F90 MOD  [elpa2_test_real_c_version_openmp] test/shared_sources/util.F90
  F90 MOD  [elpa2_test_real_c_version_openmp] test/shared_sources/read_input_parameters.F90
  F90 MOD  [elpa2_test_real_c_version_openmp] test/shared_sources/setup_mpi.F90
  F90 MOD  [elpa2_test_real_c_version_openmp] test/shared_sources/check_correctnes.F90
  F90 MOD  [elpa2_test_real_c_version_openmp] test/shared_sources/blacs_infrastructure.F90
  F90 MOD  [elpa2_test_real_c_version_openmp] test/shared_sources/prepare_matrix.F90
  F90 USE  [elpa2_test_complex_c_version_openmp] test/shared_sources/util.F90
  F90 USE  [elpa2_test_complex_c_version_openmp] test/shared_sources/read_input_parameters.F90
  F90 USE  [elpa2_test_complex_c_version_openmp] test/shared_sources/check_correctnes.F90
  F90 USE  [elpa2_test_complex_c_version_openmp] test/shared_sources/setup_mpi.F90
  F90 USE  [elpa2_test_complex_c_version_openmp] test/shared_sources/prepare_matrix.F90
  F90 USE  [elpa2_test_complex_c_version_openmp] test/shared_sources/blacs_infrastructure.F90
  F90 MOD  [elpa2_test_complex_c_version_openmp] test/shared_sources/util.F90
  F90 MOD  [elpa2_test_complex_c_version_openmp] test/shared_sources/read_input_parameters.F90
  F90 MOD  [elpa2_test_complex_c_version_openmp] test/shared_sources/check_correctnes.F90
  F90 MOD  [elpa2_test_complex_c_version_openmp] test/shared_sources/setup_mpi.F90
  F90 MOD  [elpa2_test_complex_c_version_openmp] test/shared_sources/blacs_infrastructure.F90
  F90 USE  [elpa1_test_real_with_c_openmp] test/fortran_test_programs/test_real_with_c.F90
  F90 MOD  [elpa2_test_complex_c_version_openmp] test/shared_sources/prepare_matrix.F90
  F90 USE  [elpa1_test_real_with_c_openmp] test/shared_sources/mod_from_c.F90
  F90 USE  [elpa1_test_real_with_c_openmp] test/shared_sources/util.F90
  F90 USE  [elpa1_test_real_with_c_openmp] test/shared_sources/read_input_parameters.F90
  F90 USE  [elpa1_test_real_with_c_openmp] test/shared_sources/check_correctnes.F90
  F90 USE  [elpa1_test_real_with_c_openmp] test/shared_sources/setup_mpi.F90
  F90 USE  [elpa1_test_real_with_c_openmp] test/shared_sources/blacs_infrastructure.F90
  F90 USE  [elpa1_test_real_with_c_openmp] test/shared_sources/prepare_matrix.F90
  F90 MOD  [elpa1_test_real_with_c_openmp] test/fortran_test_programs/test_real_with_c.F90
  F90 MOD  [elpa1_test_real_with_c_openmp] test/shared_sources/mod_from_c.F90
  F90 MOD  [elpa1_test_real_with_c_openmp] test/shared_sources/util.F90
  F90 MOD  [elpa1_test_real_with_c_openmp] test/shared_sources/read_input_parameters.F90
  F90 MOD  [elpa1_test_real_with_c_openmp] test/shared_sources/check_correctnes.F90
  F90 MOD  [elpa1_test_real_with_c_openmp] test/shared_sources/setup_mpi.F90
  F90 MOD  [elpa1_test_real_with_c_openmp] test/shared_sources/blacs_infrastructure.F90
  F90 USE  [libelpa_openmp_la] src/elpa_utilities.F90
  F90 MOD  [elpa1_test_real_with_c_openmp] test/shared_sources/prepare_matrix.F90
  F90 USE  [libelpa_openmp_la] src/elpa1.F90
  F90 USE  [libelpa_openmp_la] src/elpa2_utilities.F90
  F90 USE  [libelpa_openmp_la] src/elpa2.F90
  F90 USE  [libelpa_openmp_la] src/elpa_c_interface.F90
  F90 USE  [libelpa_openmp_la] src/elpa_qr/qr_utils.f90
  F90 USE  [libelpa_openmp_la] src/elpa_qr/elpa_qrkernels.f90
  F90 USE  [libelpa_openmp_la] src/elpa_qr/elpa_pdlarfb.f90
  F90 USE  [libelpa_openmp_la] src/elpa2_kernels/elpa2_kernels_real.f90
  F90 USE  [libelpa_openmp_la] src/elpa_qr/elpa_pdgeqrf.f90
  F90 USE  [libelpa_openmp_la] src/elpa2_kernels/elpa2_kernels_real_simple.f90
  F90 USE  [libelpa_openmp_la] src/elpa2_kernels/elpa2_kernels_complex.f90
  F90 USE  [libelpa_openmp_la] src/elpa2_kernels/elpa2_kernels_complex_simple.f90
  F90 MOD  [libelpa_openmp_la] src/elpa_utilities.F90
  F90 MOD  [libelpa_openmp_la] src/elpa2_utilities.F90
  F90 MOD  [libelpa_openmp_la] src/elpa1.F90
  F90 MOD  [libelpa_openmp_la] src/elpa2.F90
  F90 MOD  [libelpa_openmp_la] src/elpa_c_interface.F90
  F90 MOD  [libelpa_openmp_la] src/elpa_qr/qr_utils.f90
  F90 MOD  [libelpa_openmp_la] src/elpa_qr/elpa_qrkernels.f90
  F90 MOD  [libelpa_openmp_la] src/elpa_qr/elpa_pdlarfb.f90
  F90 MOD  [libelpa_openmp_la] src/elpa2_kernels/elpa2_kernels_real.f90
  F90 MOD  [libelpa_openmp_la] src/elpa_qr/elpa_pdgeqrf.f90
  F90 MOD  [libelpa_openmp_la] src/elpa2_kernels/elpa2_kernels_complex.f90
  F90 MOD  [libelpa_openmp_la] src/elpa2_kernels/elpa2_kernels_real_simple.f90
  F90 MOD  [libelpa_openmp_la] src/elpa2_kernels/elpa2_kernels_complex_simple.f90
  F90 DEPS /home/user/build-files/cp2k-3.0/tools/toolchain/build/elpa-2015.11.001_mt/.fortran_dependencies/dependencies.mk
./fdep/fortran_dependencies.pl elpa1_test_complex_openmp test/fortran_test_programs/test_complex.use_mods.elpa1_test_complex_openmp.o test/shared_sources/util.use_mods.elpa1_test_complex_openmp.o test/shared_sources/read_input_parameters.use_mods.elpa1_test_complex_openmp.o test/shared_sources/check_correctnes.use_mods.elpa1_test_complex_openmp.o test/shared_sources/setup_mpi.use_mods.elpa1_test_complex_openmp.o test/shared_sources/blacs_infrastructure.use_mods.elpa1_test_complex_openmp.o test/shared_sources/prepare_matrix.use_mods.elpa1_test_complex_openmp.o test/fortran_test_programs/test_complex.def_mods.elpa1_test_complex_openmp.o test/shared_sources/util.def_mods.elpa1_test_complex_openmp.o test/shared_sources/read_input_parameters.def_mods.elpa1_test_complex_openmp.o test/shared_sources/check_correctnes.def_mods.elpa1_test_complex_openmp.o test/shared_sources/setup_mpi.def_mods.elpa1_test_complex_openmp.o test/shared_sources/blacs_infrastructure.def_mods.elpa1_test_complex_openmp.o test/shared_sources/prepare_matrix.def_mods.elpa1_test_complex_openmp.o >> /home/user/build-files/cp2k-3.0/tools/toolchain/build/elpa-2015.11.001_mt/.fortran_dependencies/dependencies.mk || { rm /home/user/build-files/cp2k-3.0/tools/toolchain/build/elpa-2015.11.001_mt/.fortran_dependencies/dependencies.mk; exit 1; } ;
./fdep/fortran_dependencies.pl elpa2_test_real_openmp test/fortran_test_programs/test_real2.use_mods.elpa2_test_real_openmp.o test/shared_sources/util.use_mods.elpa2_test_real_openmp.o test/shared_sources/read_input_parameters.use_mods.elpa2_test_real_openmp.o test/shared_sources/check_correctnes.use_mods.elpa2_test_real_openmp.o test/shared_sources/setup_mpi.use_mods.elpa2_test_real_openmp.o test/shared_sources/blacs_infrastructure.use_mods.elpa2_test_real_openmp.o test/shared_sources/prepare_matrix.use_mods.elpa2_test_real_openmp.o test/fortran_test_programs/test_real2.def_mods.elpa2_test_real_openmp.o test/shared_sources/util.def_mods.elpa2_test_real_openmp.o test/shared_sources/read_input_parameters.def_mods.elpa2_test_real_openmp.o test/shared_sources/check_correctnes.def_mods.elpa2_test_real_openmp.o test/shared_sources/setup_mpi.def_mods.elpa2_test_real_openmp.o test/shared_sources/blacs_infrastructure.def_mods.elpa2_test_real_openmp.o test/shared_sources/prepare_matrix.def_mods.elpa2_test_real_openmp.o >> /home/user/build-files/cp2k-3.0/tools/toolchain/build/elpa-2015.11.001_mt/.fortran_dependencies/dependencies.mk || { rm /home/user/build-files/cp2k-3.0/tools/toolchain/build/elpa-2015.11.001_mt/.fortran_dependencies/dependencies.mk; exit 1; } ;
./fdep/fortran_dependencies.pl elpa2_test_complex_openmp test/fortran_test_programs/test_complex2.use_mods.elpa2_test_complex_openmp.o test/shared_sources/util.use_mods.elpa2_test_complex_openmp.o test/shared_sources/read_input_parameters.use_mods.elpa2_test_complex_openmp.o test/shared_sources/check_correctnes.use_mods.elpa2_test_complex_openmp.o test/shared_sources/setup_mpi.use_mods.elpa2_test_complex_openmp.o test/shared_sources/blacs_infrastructure.use_mods.elpa2_test_complex_openmp.o test/shared_sources/prepare_matrix.use_mods.elpa2_test_complex_openmp.o test/fortran_test_programs/test_complex2.def_mods.elpa2_test_complex_openmp.o test/shared_sources/util.def_mods.elpa2_test_complex_openmp.o test/shared_sources/read_input_parameters.def_mods.elpa2_test_complex_openmp.o test/shared_sources/check_correctnes.def_mods.elpa2_test_complex_openmp.o test/shared_sources/setup_mpi.def_mods.elpa2_test_complex_openmp.o test/shared_sources/blacs_infrastructure.def_mods.elpa2_test_complex_openmp.o test/shared_sources/prepare_matrix.def_mods.elpa2_test_complex_openmp.o >> /home/user/build-files/cp2k-3.0/tools/toolchain/build/elpa-2015.11.001_mt/.fortran_dependencies/dependencies.mk || { rm /home/user/build-files/cp2k-3.0/tools/toolchain/build/elpa-2015.11.001_mt/.fortran_dependencies/dependencies.mk; exit 1; } ;
./fdep/fortran_dependencies.pl elpa2_print_kernels_openmp src/print_available_elpa2_kernels.use_mods.elpa2_print_kernels_openmp.o test/shared_sources/util.use_mods.elpa2_print_kernels_openmp.o test/shared_sources/read_input_parameters.use_mods.elpa2_print_kernels_openmp.o test/shared_sources/check_correctnes.use_mods.elpa2_print_kernels_openmp.o test/shared_sources/setup_mpi.use_mods.elpa2_print_kernels_openmp.o test/shared_sources/blacs_infrastructure.use_mods.elpa2_print_kernels_openmp.o test/shared_sources/prepare_matrix.use_mods.elpa2_print_kernels_openmp.o src/print_available_elpa2_kernels.def_mods.elpa2_print_kernels_openmp.o test/shared_sources/util.def_mods.elpa2_print_kernels_openmp.o test/shared_sources/read_input_parameters.def_mods.elpa2_print_kernels_openmp.o test/shared_sources/check_correctnes.def_mods.elpa2_print_kernels_openmp.o test/shared_sources/setup_mpi.def_mods.elpa2_print_kernels_openmp.o test/shared_sources/blacs_infrastructure.def_mods.elpa2_print_kernels_openmp.o test/shared_sources/prepare_matrix.def_mods.elpa2_print_kernels_openmp.o >> /home/user/build-files/cp2k-3.0/tools/toolchain/build/elpa-2015.11.001_mt/.fortran_dependencies/dependencies.mk || { rm /home/user/build-files/cp2k-3.0/tools/toolchain/build/elpa-2015.11.001_mt/.fortran_dependencies/dependencies.mk; exit 1; } ;
./fdep/fortran_dependencies.pl elpa2_test_real_default_kernel_openmp test/fortran_test_programs/test_real2_default_kernel.use_mods.elpa2_test_real_default_kernel_openmp.o test/shared_sources/util.use_mods.elpa2_test_real_default_kernel_openmp.o test/shared_sources/read_input_parameters.use_mods.elpa2_test_real_default_kernel_openmp.o test/shared_sources/check_correctnes.use_mods.elpa2_test_real_default_kernel_openmp.o test/shared_sources/setup_mpi.use_mods.elpa2_test_real_default_kernel_openmp.o test/shared_sources/blacs_infrastructure.use_mods.elpa2_test_real_default_kernel_openmp.o test/shared_sources/prepare_matrix.use_mods.elpa2_test_real_default_kernel_openmp.o test/fortran_test_programs/test_real2_default_kernel.def_mods.elpa2_test_real_default_kernel_openmp.o test/shared_sources/util.def_mods.elpa2_test_real_default_kernel_openmp.o test/shared_sources/read_input_parameters.def_mods.elpa2_test_real_default_kernel_openmp.o test/shared_sources/check_correctnes.def_mods.elpa2_test_real_default_kernel_openmp.o test/shared_sources/setup_mpi.def_mods.elpa2_test_real_default_kernel_openmp.o test/shared_sources/blacs_infrastructure.def_mods.elpa2_test_real_default_kernel_openmp.o test/shared_sources/prepare_matrix.def_mods.elpa2_test_real_default_kernel_openmp.o >> /home/user/build-files/cp2k-3.0/tools/toolchain/build/elpa-2015.11.001_mt/.fortran_dependencies/dependencies.mk || { rm /home/user/build-files/cp2k-3.0/tools/toolchain/build/elpa-2015.11.001_mt/.fortran_dependencies/dependencies.mk; exit 1; } ;
./fdep/fortran_dependencies.pl elpa2_test_real_default_kernel_qr_decomposition_openmp test/fortran_test_programs/test_real2_default_kernel_qr_decomposition.use_mods.elpa2_test_real_default_kernel_qr_decomposition_openmp.o test/shared_sources/util.use_mods.elpa2_test_real_default_kernel_qr_decomposition_openmp.o test/shared_sources/read_input_parameters.use_mods.elpa2_test_real_default_kernel_qr_decomposition_openmp.o test/shared_sources/check_correctnes.use_mods.elpa2_test_real_default_kernel_qr_decomposition_openmp.o test/shared_sources/setup_mpi.use_mods.elpa2_test_real_default_kernel_qr_decomposition_openmp.o test/shared_sources/blacs_infrastructure.use_mods.elpa2_test_real_default_kernel_qr_decomposition_openmp.o test/shared_sources/prepare_matrix.use_mods.elpa2_test_real_default_kernel_qr_decomposition_openmp.o test/fortran_test_programs/test_real2_default_kernel_qr_decomposition.def_mods.elpa2_test_real_default_kernel_qr_decomposition_openmp.o test/shared_sources/util.def_mods.elpa2_test_real_default_kernel_qr_decomposition_openmp.o test/shared_sources/read_input_parameters.def_mods.elpa2_test_real_default_kernel_qr_decomposition_openmp.o test/shared_sources/check_correctnes.def_mods.elpa2_test_real_default_kernel_qr_decomposition_openmp.o test/shared_sources/setup_mpi.def_mods.elpa2_test_real_default_kernel_qr_decomposition_openmp.o test/shared_sources/blacs_infrastructure.def_mods.elpa2_test_real_default_kernel_qr_decomposition_openmp.o test/shared_sources/prepare_matrix.def_mods.elpa2_test_real_default_kernel_qr_decomposition_openmp.o >> /home/user/build-files/cp2k-3.0/tools/toolchain/build/elpa-2015.11.001_mt/.fortran_dependencies/dependencies.mk || { rm /home/user/build-files/cp2k-3.0/tools/toolchain/build/elpa-2015.11.001_mt/.fortran_dependencies/dependencies.mk; exit 1; } ;
./fdep/fortran_dependencies.pl elpa2_test_complex_default_kernel_openmp test/fortran_test_programs/test_complex2_default_kernel.use_mods.elpa2_test_complex_default_kernel_openmp.o test/shared_sources/util.use_mods.elpa2_test_complex_default_kernel_openmp.o test/shared_sources/read_input_parameters.use_mods.elpa2_test_complex_default_kernel_openmp.o test/shared_sources/check_correctnes.use_mods.elpa2_test_complex_default_kernel_openmp.o test/shared_sources/setup_mpi.use_mods.elpa2_test_complex_default_kernel_openmp.o test/shared_sources/blacs_infrastructure.use_mods.elpa2_test_complex_default_kernel_openmp.o test/shared_sources/prepare_matrix.use_mods.elpa2_test_complex_default_kernel_openmp.o test/fortran_test_programs/test_complex2_default_kernel.def_mods.elpa2_test_complex_default_kernel_openmp.o test/shared_sources/util.def_mods.elpa2_test_complex_default_kernel_openmp.o test/shared_sources/read_input_parameters.def_mods.elpa2_test_complex_default_kernel_openmp.o test/shared_sources/check_correctnes.def_mods.elpa2_test_complex_default_kernel_openmp.o test/shared_sources/setup_mpi.def_mods.elpa2_test_complex_default_kernel_openmp.o test/shared_sources/blacs_infrastructure.def_mods.elpa2_test_complex_default_kernel_openmp.o test/shared_sources/prepare_matrix.def_mods.elpa2_test_complex_default_kernel_openmp.o >> /home/user/build-files/cp2k-3.0/tools/toolchain/build/elpa-2015.11.001_mt/.fortran_dependencies/dependencies.mk || { rm /home/user/build-files/cp2k-3.0/tools/toolchain/build/elpa-2015.11.001_mt/.fortran_dependencies/dependencies.mk; exit 1; } ;
./fdep/fortran_dependencies.pl elpa2_test_real_choose_kernel_with_api_openmp test/fortran_test_programs/test_real2_choose_kernel_with_api.use_mods.elpa2_test_real_choose_kernel_with_api_openmp.o test/shared_sources/util.use_mods.elpa2_test_real_choose_kernel_with_api_openmp.o test/shared_sources/read_input_parameters.use_mods.elpa2_test_real_choose_kernel_with_api_openmp.o test/shared_sources/check_correctnes.use_mods.elpa2_test_real_choose_kernel_with_api_openmp.o test/shared_sources/setup_mpi.use_mods.elpa2_test_real_choose_kernel_with_api_openmp.o test/shared_sources/blacs_infrastructure.use_mods.elpa2_test_real_choose_kernel_with_api_openmp.o test/shared_sources/prepare_matrix.use_mods.elpa2_test_real_choose_kernel_with_api_openmp.o test/fortran_test_programs/test_real2_choose_kernel_with_api.def_mods.elpa2_test_real_choose_kernel_with_api_openmp.o test/shared_sources/util.def_mods.elpa2_test_real_choose_kernel_with_api_openmp.o test/shared_sources/read_input_parameters.def_mods.elpa2_test_real_choose_kernel_with_api_openmp.o test/shared_sources/check_correctnes.def_mods.elpa2_test_real_choose_kernel_with_api_openmp.o test/shared_sources/setup_mpi.def_mods.elpa2_test_real_choose_kernel_with_api_openmp.o test/shared_sources/blacs_infrastructure.def_mods.elpa2_test_real_choose_kernel_with_api_openmp.o test/shared_sources/prepare_matrix.def_mods.elpa2_test_real_choose_kernel_with_api_openmp.o >> /home/user/build-files/cp2k-3.0/tools/toolchain/build/elpa-2015.11.001_mt/.fortran_dependencies/dependencies.mk || { rm /home/user/build-files/cp2k-3.0/tools/toolchain/build/elpa-2015.11.001_mt/.fortran_dependencies/dependencies.mk; exit 1; } ;
./fdep/fortran_dependencies.pl elpa2_test_complex_choose_kernel_with_api_openmp test/fortran_test_programs/test_complex2_choose_kernel_with_api.use_mods.elpa2_test_complex_choose_kernel_with_api_openmp.o test/shared_sources/util.use_mods.elpa2_test_complex_choose_kernel_with_api_openmp.o test/shared_sources/read_input_parameters.use_mods.elpa2_test_complex_choose_kernel_with_api_openmp.o test/shared_sources/check_correctnes.use_mods.elpa2_test_complex_choose_kernel_with_api_openmp.o test/shared_sources/setup_mpi.use_mods.elpa2_test_complex_choose_kernel_with_api_openmp.o test/shared_sources/blacs_infrastructure.use_mods.elpa2_test_complex_choose_kernel_with_api_openmp.o test/shared_sources/prepare_matrix.use_mods.elpa2_test_complex_choose_kernel_with_api_openmp.o test/fortran_test_programs/test_complex2_choose_kernel_with_api.def_mods.elpa2_test_complex_choose_kernel_with_api_openmp.o test/shared_sources/util.def_mods.elpa2_test_complex_choose_kernel_with_api_openmp.o test/shared_sources/read_input_parameters.def_mods.elpa2_test_complex_choose_kernel_with_api_openmp.o test/shared_sources/check_correctnes.def_mods.elpa2_test_complex_choose_kernel_with_api_openmp.o test/shared_sources/setup_mpi.def_mods.elpa2_test_complex_choose_kernel_with_api_openmp.o test/shared_sources/blacs_infrastructure.def_mods.elpa2_test_complex_choose_kernel_with_api_openmp.o test/shared_sources/prepare_matrix.def_mods.elpa2_test_complex_choose_kernel_with_api_openmp.o >> /home/user/build-files/cp2k-3.0/tools/toolchain/build/elpa-2015.11.001_mt/.fortran_dependencies/dependencies.mk || { rm /home/user/build-files/cp2k-3.0/tools/toolchain/build/elpa-2015.11.001_mt/.fortran_dependencies/dependencies.mk; exit 1; } ;
./fdep/fortran_dependencies.pl elpa1_test_real_c_version_openmp test/shared_sources/util.use_mods.elpa1_test_real_c_version_openmp.o test/shared_sources/read_input_parameters.use_mods.elpa1_test_real_c_version_openmp.o test/shared_sources/check_correctnes.use_mods.elpa1_test_real_c_version_openmp.o test/shared_sources/setup_mpi.use_mods.elpa1_test_real_c_version_openmp.o test/shared_sources/blacs_infrastructure.use_mods.elpa1_test_real_c_version_openmp.o test/shared_sources/prepare_matrix.use_mods.elpa1_test_real_c_version_openmp.o test/shared_sources/util.def_mods.elpa1_test_real_c_version_openmp.o test/shared_sources/read_input_parameters.def_mods.elpa1_test_real_c_version_openmp.o test/shared_sources/check_correctnes.def_mods.elpa1_test_real_c_version_openmp.o test/shared_sources/setup_mpi.def_mods.elpa1_test_real_c_version_openmp.o test/shared_sources/blacs_infrastructure.def_mods.elpa1_test_real_c_version_openmp.o test/shared_sources/prepare_matrix.def_mods.elpa1_test_real_c_version_openmp.o >> /home/user/build-files/cp2k-3.0/tools/toolchain/build/elpa-2015.11.001_mt/.fortran_dependencies/dependencies.mk || { rm /home/user/build-files/cp2k-3.0/tools/toolchain/build/elpa-2015.11.001_mt/.fortran_dependencies/dependencies.mk; exit 1; } ;
./fdep/fortran_dependencies.pl elpa1_test_complex_c_version_openmp test/shared_sources/util.use_mods.elpa1_test_complex_c_version_openmp.o test/shared_sources/read_input_parameters.use_mods.elpa1_test_complex_c_version_openmp.o test/shared_sources/check_correctnes.use_mods.elpa1_test_complex_c_version_openmp.o test/shared_sources/setup_mpi.use_mods.elpa1_test_complex_c_version_openmp.o test/shared_sources/blacs_infrastructure.use_mods.elpa1_test_complex_c_version_openmp.o test/shared_sources/prepare_matrix.use_mods.elpa1_test_complex_c_version_openmp.o test/shared_sources/util.def_mods.elpa1_test_complex_c_version_openmp.o test/shared_sources/read_input_parameters.def_mods.elpa1_test_complex_c_version_openmp.o test/shared_sources/check_correctnes.def_mods.elpa1_test_complex_c_version_openmp.o test/shared_sources/setup_mpi.def_mods.elpa1_test_complex_c_version_openmp.o test/shared_sources/blacs_infrastructure.def_mods.elpa1_test_complex_c_version_openmp.o test/shared_sources/prepare_matrix.def_mods.elpa1_test_complex_c_version_openmp.o >> /home/user/build-files/cp2k-3.0/tools/toolchain/build/elpa-2015.11.001_mt/.fortran_dependencies/dependencies.mk || { rm /home/user/build-files/cp2k-3.0/tools/toolchain/build/elpa-2015.11.001_mt/.fortran_dependencies/dependencies.mk; exit 1; } ;
./fdep/fortran_dependencies.pl elpa2_test_real_c_version_openmp test/shared_sources/util.use_mods.elpa2_test_real_c_version_openmp.o test/shared_sources/read_input_parameters.use_mods.elpa2_test_real_c_version_openmp.o test/shared_sources/check_correctnes.use_mods.elpa2_test_real_c_version_openmp.o test/shared_sources/setup_mpi.use_mods.elpa2_test_real_c_version_openmp.o test/shared_sources/blacs_infrastructure.use_mods.elpa2_test_real_c_version_openmp.o test/shared_sources/prepare_matrix.use_mods.elpa2_test_real_c_version_openmp.o test/shared_sources/util.def_mods.elpa2_test_real_c_version_openmp.o test/shared_sources/read_input_parameters.def_mods.elpa2_test_real_c_version_openmp.o test/shared_sources/check_correctnes.def_mods.elpa2_test_real_c_version_openmp.o test/shared_sources/setup_mpi.def_mods.elpa2_test_real_c_version_openmp.o test/shared_sources/blacs_infrastructure.def_mods.elpa2_test_real_c_version_openmp.o test/shared_sources/prepare_matrix.def_mods.elpa2_test_real_c_version_openmp.o >> /home/user/build-files/cp2k-3.0/tools/toolchain/build/elpa-2015.11.001_mt/.fortran_dependencies/dependencies.mk || { rm /home/user/build-files/cp2k-3.0/tools/toolchain/build/elpa-2015.11.001_mt/.fortran_dependencies/dependencies.mk; exit 1; } ;
./fdep/fortran_dependencies.pl elpa2_test_complex_c_version_openmp test/shared_sources/util.use_mods.elpa2_test_complex_c_version_openmp.o test/shared_sources/read_input_parameters.use_mods.elpa2_test_complex_c_version_openmp.o test/shared_sources/check_correctnes.use_mods.elpa2_test_complex_c_version_openmp.o test/shared_sources/setup_mpi.use_mods.elpa2_test_complex_c_version_openmp.o test/shared_sources/blacs_infrastructure.use_mods.elpa2_test_complex_c_version_openmp.o test/shared_sources/prepare_matrix.use_mods.elpa2_test_complex_c_version_openmp.o test/shared_sources/util.def_mods.elpa2_test_complex_c_version_openmp.o test/shared_sources/read_input_parameters.def_mods.elpa2_test_complex_c_version_openmp.o test/shared_sources/check_correctnes.def_mods.elpa2_test_complex_c_version_openmp.o test/shared_sources/setup_mpi.def_mods.elpa2_test_complex_c_version_openmp.o test/shared_sources/blacs_infrastructure.def_mods.elpa2_test_complex_c_version_openmp.o test/shared_sources/prepare_matrix.def_mods.elpa2_test_complex_c_version_openmp.o >> /home/user/build-files/cp2k-3.0/tools/toolchain/build/elpa-2015.11.001_mt/.fortran_dependencies/dependencies.mk || { rm /home/user/build-files/cp2k-3.0/tools/toolchain/build/elpa-2015.11.001_mt/.fortran_dependencies/dependencies.mk; exit 1; } ;
./fdep/fortran_dependencies.pl elpa1_test_real_with_c_openmp test/fortran_test_programs/test_real_with_c.use_mods.elpa1_test_real_with_c_openmp.o test/shared_sources/mod_from_c.use_mods.elpa1_test_real_with_c_openmp.o test/shared_sources/util.use_mods.elpa1_test_real_with_c_openmp.o test/shared_sources/read_input_parameters.use_mods.elpa1_test_real_with_c_openmp.o test/shared_sources/check_correctnes.use_mods.elpa1_test_real_with_c_openmp.o test/shared_sources/setup_mpi.use_mods.elpa1_test_real_with_c_openmp.o test/shared_sources/blacs_infrastructure.use_mods.elpa1_test_real_with_c_openmp.o test/shared_sources/prepare_matrix.use_mods.elpa1_test_real_with_c_openmp.o test/fortran_test_programs/test_real_with_c.def_mods.elpa1_test_real_with_c_openmp.o test/shared_sources/mod_from_c.def_mods.elpa1_test_real_with_c_openmp.o test/shared_sources/util.def_mods.elpa1_test_real_with_c_openmp.o test/shared_sources/read_input_parameters.def_mods.elpa1_test_real_with_c_openmp.o test/shared_sources/check_correctnes.def_mods.elpa1_test_real_with_c_openmp.o test/shared_sources/setup_mpi.def_mods.elpa1_test_real_with_c_openmp.o test/shared_sources/blacs_infrastructure.def_mods.elpa1_test_real_with_c_openmp.o test/shared_sources/prepare_matrix.def_mods.elpa1_test_real_with_c_openmp.o >> /home/user/build-files/cp2k-3.0/tools/toolchain/build/elpa-2015.11.001_mt/.fortran_dependencies/dependencies.mk || { rm /home/user/build-files/cp2k-3.0/tools/toolchain/build/elpa-2015.11.001_mt/.fortran_dependencies/dependencies.mk; exit 1; } ;
./fdep/fortran_dependencies.pl libelpa_openmp_la src/elpa_utilities.use_mods.libelpa_openmp_la.lo src/elpa1.use_mods.libelpa_openmp_la.lo src/elpa2_utilities.use_mods.libelpa_openmp_la.lo src/elpa2.use_mods.libelpa_openmp_la.lo src/elpa_c_interface.use_mods.libelpa_openmp_la.lo src/elpa_qr/qr_utils.use_mods.libelpa_openmp_la.lo src/elpa_qr/elpa_qrkernels.use_mods.libelpa_openmp_la.lo src/elpa_qr/elpa_pdlarfb.use_mods.libelpa_openmp_la.lo src/elpa_qr/elpa_pdgeqrf.use_mods.libelpa_openmp_la.lo src/elpa2_kernels/elpa2_kernels_real.use_mods.libelpa_openmp_la.lo src/elpa2_kernels/elpa2_kernels_complex.use_mods.libelpa_openmp_la.lo src/elpa2_kernels/elpa2_kernels_real_simple.use_mods.libelpa_openmp_la.lo src/elpa2_kernels/elpa2_kernels_complex_simple.use_mods.libelpa_openmp_la.lo src/elpa_utilities.def_mods.libelpa_openmp_la.lo src/elpa1.def_mods.libelpa_openmp_la.lo src/elpa2_utilities.def_mods.libelpa_openmp_la.lo src/elpa2.def_mods.libelpa_openmp_la.lo src/elpa_c_interface.def_mods.libelpa_openmp_la.lo src/elpa_qr/qr_utils.def_mods.libelpa_openmp_la.lo src/elpa_qr/elpa_qrkernels.def_mods.libelpa_openmp_la.lo src/elpa_qr/elpa_pdlarfb.def_mods.libelpa_openmp_la.lo src/elpa_qr/elpa_pdgeqrf.def_mods.libelpa_openmp_la.lo src/elpa2_kernels/elpa2_kernels_real.def_mods.libelpa_openmp_la.lo src/elpa2_kernels/elpa2_kernels_complex.def_mods.libelpa_openmp_la.lo src/elpa2_kernels/elpa2_kernels_real_simple.def_mods.libelpa_openmp_la.lo src/elpa2_kernels/elpa2_kernels_complex_simple.def_mods.libelpa_openmp_la.lo >> /home/user/build-files/cp2k-3.0/tools/toolchain/build/elpa-2015.11.001_mt/.fortran_dependencies/dependencies.mk || { rm /home/user/build-files/cp2k-3.0/tools/toolchain/build/elpa-2015.11.001_mt/.fortran_dependencies/dependencies.mk; exit 1; } ;
  FC       src/elpa2_kernels/elpa2_kernels_real_simple.lo
  FC       src/elpa_qr/elpa_qrkernels.lo
  FC       src/elpa2_kernels/elpa2_kernels_complex.lo
  FC       src/elpa2_kernels/elpa2_kernels_complex_simple.lo
  CCAS     src/elpa2_kernels/elpa2_kernels_asm_x86_64.lo
  FC       src/elpa2_kernels/elpa2_kernels_real.lo
  CC       src/elpa2_kernels/elpa2_kernels_real_sse-avx_6hv.lo
  CC       src/elpa2_kernels/elpa2_kernels_real_sse-avx_4hv.lo
  CXX      src/elpa2_kernels/elpa2_kernels_complex_sse-avx_1hv.lo
  CC       src/elpa2_kernels/elpa2_kernels_real_sse-avx_2hv.lo
  CXX      src/elpa2_kernels/elpa2_kernels_complex_sse-avx_2hv.lo
  PPFC     src/elpa_utilities.lo
src/elpa2_kernels/elpa2_kernels_real.f90:89:39:

        call hh_trafo_kernel_12_generic(q(i,1),hh, nb, ldq, ldh, s)
                                       1
Warning: Type mismatch in argument ‘q’ at (1); passed REAL(8) to COMPLEX(8)
src/elpa2_kernels/elpa2_kernels_real.f90:95:38:

        call hh_trafo_kernel_8_generic(q(i,1),hh, nb, ldq, ldh, s)
                                      1
Warning: Type mismatch in argument ‘q’ at (1); passed REAL(8) to COMPLEX(8)
src/elpa2_kernels/elpa2_kernels_real.f90:97:38:

        call hh_trafo_kernel_4_generic(q(i,1),hh, nb, ldq, ldh, s)
                                      1
Warning: Type mismatch in argument ‘q’ at (1); passed REAL(8) to COMPLEX(8)
  PPFC     src/elpa1.lo
  PPFC     src/elpa2_utilities.lo
src/elpa2_kernels/elpa2_kernels_real_sse-avx_4hv.c: In function ‘hh_trafo_kernel_12_AVX_4hv’:
src/elpa2_kernels/elpa2_kernels_real_sse-avx_4hv.c:74:32: warning: implicit declaration of function ‘_mm256_msub’ [-Wimplicit-function-declaration]
 #define _mm256_FMSUB_pd(a,b,c) _mm256_msub(a,b,c)
                                ^
src/elpa2_kernels/elpa2_kernels_real_sse-avx_4hv.c:504:7: note: in expansion of macro ‘_mm256_FMSUB_pd’
  y1 = _mm256_FMSUB_pd(y1, h1, _mm256_mul_pd(x1,h2));
       ^
src/elpa2_kernels/elpa2_kernels_real_sse-avx_4hv.c:504:5: error: incompatible types when assigning to type ‘__m256d {aka __vector(4) double}’ from type ‘int’
  y1 = _mm256_FMSUB_pd(y1, h1, _mm256_mul_pd(x1,h2));
     ^
src/elpa2_kernels/elpa2_kernels_real_sse-avx_4hv.c:505:5: error: incompatible types when assigning to type ‘__m256d {aka __vector(4) double}’ from type ‘int’
  y2 = _mm256_FMSUB_pd(y2, h1, _mm256_mul_pd(x2,h2));
     ^
src/elpa2_kernels/elpa2_kernels_real_sse-avx_4hv.c:506:5: error: incompatible types when assigning to type ‘__m256d {aka __vector(4) double}’ from type ‘int’
  y3 = _mm256_FMSUB_pd(y3, h1, _mm256_mul_pd(x3,h2));
     ^
src/elpa2_kernels/elpa2_kernels_real_sse-avx_4hv.c:521:5: error: incompatible types when assigning to type ‘__m256d {aka __vector(4) double}’ from type ‘int’
  z1 = _mm256_FMSUB_pd(z1, h1, _mm256_FMA_pd(y1, h3, _mm256_mul_pd(x1,h2)));
     ^
src/elpa2_kernels/elpa2_kernels_real_sse-avx_4hv.c:522:5: error: incompatible types when assigning to type ‘__m256d {aka __vector(4) double}’ from type ‘int’
  z2 = _mm256_FMSUB_pd(z2, h1, _mm256_FMA_pd(y2, h3, _mm256_mul_pd(x2,h2)));
     ^
src/elpa2_kernels/elpa2_kernels_real_sse-avx_4hv.c:523:5: error: incompatible types when assigning to type ‘__m256d {aka __vector(4) double}’ from type ‘int’
  z3 = _mm256_FMSUB_pd(z3, h1, _mm256_FMA_pd(y3, h3, _mm256_mul_pd(x3,h2)));
     ^
src/elpa2_kernels/elpa2_kernels_real_sse-avx_4hv.c:540:5: error: incompatible types when assigning to type ‘__m256d {aka __vector(4) double}’ from type ‘int’
  w1 = _mm256_FMSUB_pd(w1, h1, _mm256_FMA_pd(z1, h4, _mm256_FMA_pd(y1, h3, _mm256_mul_pd(x1,h2))));
     ^
src/elpa2_kernels/elpa2_kernels_real_sse-avx_4hv.c:541:5: error: incompatible types when assigning to type ‘__m256d {aka __vector(4) double}’ from type ‘int’
  w2 = _mm256_FMSUB_pd(w2, h1, _mm256_FMA_pd(z2, h4, _mm256_FMA_pd(y2, h3, _mm256_mul_pd(x2,h2))));
     ^
src/elpa2_kernels/elpa2_kernels_real_sse-avx_4hv.c:542:5: error: incompatible types when assigning to type ‘__m256d {aka __vector(4) double}’ from type ‘int’
  w3 = _mm256_FMSUB_pd(w3, h1, _mm256_FMA_pd(z3, h4, _mm256_FMA_pd(y3, h3, _mm256_mul_pd(x3,h2))));
     ^
src/elpa2_kernels/elpa2_kernels_real_sse-avx_4hv.c: In function ‘hh_trafo_kernel_8_AVX_4hv’:
src/elpa2_kernels/elpa2_kernels_real_sse-avx_4hv.c:970:5: error: incompatible types when assigning to type ‘__m256d {aka __vector(4) double}’ from type ‘int’
  y1 = _mm256_FMSUB_pd(y1, h1, _mm256_mul_pd(x1,h2));
     ^
src/elpa2_kernels/elpa2_kernels_real_sse-avx_4hv.c:971:5: error: incompatible types when assigning to type ‘__m256d {aka __vector(4) double}’ from type ‘int’
  y2 = _mm256_FMSUB_pd(y2, h1, _mm256_mul_pd(x2,h2));
     ^
src/elpa2_kernels/elpa2_kernels_real_sse-avx_4hv.c:981:5: error: incompatible types when assigning to type ‘__m256d {aka __vector(4) double}’ from type ‘int’
  z1 = _mm256_FMSUB_pd(z1, h1, _mm256_FMA_pd(y1, h3, _mm256_mul_pd(x1,h2)));
     ^
src/elpa2_kernels/elpa2_kernels_real_sse-avx_4hv.c:982:5: error: incompatible types when assigning to type ‘__m256d {aka __vector(4) double}’ from type ‘int’
  z2 = _mm256_FMSUB_pd(z2, h1, _mm256_FMA_pd(y2, h3, _mm256_mul_pd(x2,h2)));
     ^
src/elpa2_kernels/elpa2_kernels_real_sse-avx_4hv.c:993:5: error: incompatible types when assigning to type ‘__m256d {aka __vector(4) double}’ from type ‘int’
  w1 = _mm256_FMSUB_pd(w1, h1, _mm256_FMA_pd(z1, h4, _mm256_FMA_pd(y1, h3, _mm256_mul_pd(x1,h2))));
     ^
src/elpa2_kernels/elpa2_kernels_real_sse-avx_4hv.c:994:5: error: incompatible types when assigning to type ‘__m256d {aka __vector(4) double}’ from type ‘int’
  w2 = _mm256_FMSUB_pd(w2, h1, _mm256_FMA_pd(z2, h4, _mm256_FMA_pd(y2, h3, _mm256_mul_pd(x2,h2))));
     ^
src/elpa2_kernels/elpa2_kernels_real_sse-avx_4hv.c: In function ‘hh_trafo_kernel_4_AVX_4hv’:
src/elpa2_kernels/elpa2_kernels_real_sse-avx_4hv.c:1266:5: error: incompatible types when assigning to type ‘__m256d {aka __vector(4) double}’ from type ‘int’
  y1 = _mm256_FMSUB_pd(y1, h1, _mm256_mul_pd(x1,h2));
     ^
src/elpa2_kernels/elpa2_kernels_real_sse-avx_4hv.c:1275:5: error: incompatible types when assigning to type ‘__m256d {aka __vector(4) double}’ from type ‘int’
  z1 = _mm256_FMSUB_pd(z1, h1, _mm256_FMA_pd(y1, h3, _mm256_mul_pd(x1,h2)));
     ^
src/elpa2_kernels/elpa2_kernels_real_sse-avx_4hv.c:1285:5: error: incompatible types when assigning to type ‘__m256d {aka __vector(4) double}’ from type ‘int’
  w1 = _mm256_FMSUB_pd(w1, h1, _mm256_FMA_pd(z1, h4, _mm256_FMA_pd(y1, h3, _mm256_mul_pd(x1,h2))));
     ^
src/elpa2_kernels/elpa2_kernels_real_sse-avx_6hv.c: In function ‘hh_trafo_kernel_8_AVX_6hv’:
src/elpa2_kernels/elpa2_kernels_real_sse-avx_6hv.c:74:32: warning: implicit declaration of function ‘_mm256_msub’ [-Wimplicit-function-declaration]
 #define _mm256_FMSUB_pd(a,b,c) _mm256_msub(a,b,c)
                                ^
src/elpa2_kernels/elpa2_kernels_real_sse-avx_6hv.c:757:7: note: in expansion of macro ‘_mm256_FMSUB_pd’
  y1 = _mm256_FMSUB_pd(y1, tau2, _mm256_mul_pd(x1,h2));
       ^
src/elpa2_kernels/elpa2_kernels_real_sse-avx_6hv.c:757:5: error: incompatible types when assigning to type ‘__m256d {aka __vector(4) double}’ from type ‘int’
  y1 = _mm256_FMSUB_pd(y1, tau2, _mm256_mul_pd(x1,h2));
     ^
src/elpa2_kernels/elpa2_kernels_real_sse-avx_6hv.c:758:5: error: incompatible types when assigning to type ‘__m256d {aka __vector(4) double}’ from type ‘int’
  y2 = _mm256_FMSUB_pd(y2, tau2, _mm256_mul_pd(x2,h2));
     ^
src/elpa2_kernels/elpa2_kernels_real_sse-avx_6hv.c:770:5: error: incompatible types when assigning to type ‘__m256d {aka __vector(4) double}’ from type ‘int’
  z1 = _mm256_FMSUB_pd(z1, tau3, _mm256_FMA_pd(y1, h3, _mm256_mul_pd(x1,h2)));
     ^
src/elpa2_kernels/elpa2_kernels_real_sse-avx_6hv.c:771:5: error: incompatible types when assigning to type ‘__m256d {aka __vector(4) double}’ from type ‘int’
  z2 = _mm256_FMSUB_pd(z2, tau3, _mm256_FMA_pd(y2, h3, _mm256_mul_pd(x2,h2)));
     ^
src/elpa2_kernels/elpa2_kernels_real_sse-avx_6hv.c:785:5: error: incompatible types when assigning to type ‘__m256d {aka __vector(4) double}’ from type ‘int’
  w1 = _mm256_FMSUB_pd(w1, tau4, _mm256_FMA_pd(z1, h4, _mm256_FMA_pd(y1, h3, _mm256_mul_pd(x1,h2))));
     ^
src/elpa2_kernels/elpa2_kernels_real_sse-avx_6hv.c:786:5: error: incompatible types when assigning to type ‘__m256d {aka __vector(4) double}’ from type ‘int’
  w2 = _mm256_FMSUB_pd(w2, tau4, _mm256_FMA_pd(z2, h4, _mm256_FMA_pd(y2, h3, _mm256_mul_pd(x2,h2))));
     ^
src/elpa2_kernels/elpa2_kernels_real_sse-avx_6hv.c:802:5: error: incompatible types when assigning to type ‘__m256d {aka __vector(4) double}’ from type ‘int’
  v1 = _mm256_FMSUB_pd(v1, tau5, _mm256_add_pd(_mm256_FMA_pd(w1, h5, _mm256_mul_pd(z1,h4)), _mm256_FMA_pd(y1, h3, _mm256_mul_pd(x1,h2))));
     ^
src/elpa2_kernels/elpa2_kernels_real_sse-avx_6hv.c:803:5: error: incompatible types when assigning to type ‘__m256d {aka __vector(4) double}’ from type ‘int’
  v2 = _mm256_FMSUB_pd(v2, tau5, _mm256_add_pd(_mm256_FMA_pd(w2, h5, _mm256_mul_pd(z2,h4)), _mm256_FMA_pd(y2, h3, _mm256_mul_pd(x2,h2))));
     ^
src/elpa2_kernels/elpa2_kernels_real_sse-avx_6hv.c:821:5: error: incompatible types when assigning to type ‘__m256d {aka __vector(4) double}’ from type ‘int’
  t1 = _mm256_FMSUB_pd(t1, tau6, _mm256_FMA_pd(v1, h6, _mm256_add_pd(_mm256_FMA_pd(w1, h5, _mm256_mul_pd(z1,h4)), _mm256_FMA_pd(y1, h3, _mm256_mul_pd(x1,h2)))));
     ^
src/elpa2_kernels/elpa2_kernels_real_sse-avx_6hv.c:822:5: error: incompatible types when assigning to type ‘__m256d {aka __vector(4) double}’ from type ‘int’
  t2 = _mm256_FMSUB_pd(t2, tau6, _mm256_FMA_pd(v2, h6, _mm256_add_pd(_mm256_FMA_pd(w2, h5, _mm256_mul_pd(z2,h4)), _mm256_FMA_pd(y2, h3, _mm256_mul_pd(x2,h2)))));
     ^
At top level:
src/elpa2_kernels/elpa2_kernels_real_sse-avx_4hv.c:1145:20: warning: always_inline function might not be inlinable [-Wattributes]
 __forceinline void hh_trafo_kernel_4_AVX_4hv(double* q, double* hh, int nb, int ldq, int ldh, double s_1_2, double s_1_3, double s_2_3, double s_1_4, double s_2_4, double s_3_4)
                    ^
src/elpa2_kernels/elpa2_kernels_real_sse-avx_4hv.c:790:20: warning: always_inline function might not be inlinable [-Wattributes]
 __forceinline void hh_trafo_kernel_8_AVX_4hv(double* q, double* hh, int nb, int ldq, int ldh, double s_1_2, double s_1_3, double s_2_3, double s_1_4, double s_2_4, double s_3_4)
                    ^
src/elpa2_kernels/elpa2_kernels_real_sse-avx_4hv.c:262:20: warning: always_inline function might not be inlinable [-Wattributes]
 __forceinline void hh_trafo_kernel_12_AVX_4hv(double* q, double* hh, int nb, int ldq, int ldh, double s_1_2, double s_1_3, double s_2_3, double s_1_4, double s_2_4, double s_3_4)
                    ^
src/elpa2_kernels/elpa2_kernels_real_sse-avx_6hv.c: In function ‘hh_trafo_kernel_4_AVX_6hv’:
src/elpa2_kernels/elpa2_kernels_real_sse-avx_6hv.c:1437:5: error: incompatible types when assigning to type ‘__m256d {aka __vector(4) double}’ from type ‘int’
  y1 = _mm256_FMSUB_pd(y1, tau2, _mm256_mul_pd(x1,h2));
     ^
src/elpa2_kernels/elpa2_kernels_real_sse-avx_6hv.c:1448:5: error: incompatible types when assigning to type ‘__m256d {aka __vector(4) double}’ from type ‘int’
  z1 = _mm256_FMSUB_pd(z1, tau3, _mm256_FMA_pd(y1, h3, _mm256_mul_pd(x1,h2)));
     ^
src/elpa2_kernels/elpa2_kernels_real_sse-avx_6hv.c:1461:5: error: incompatible types when assigning to type ‘__m256d {aka __vector(4) double}’ from type ‘int’
  w1 = _mm256_FMSUB_pd(w1, tau4, _mm256_FMA_pd(z1, h4, _mm256_FMA_pd(y1, h3, _mm256_mul_pd(x1,h2))));
     ^
src/elpa2_kernels/elpa2_kernels_real_sse-avx_6hv.c:1476:5: error: incompatible types when assigning to type ‘__m256d {aka __vector(4) double}’ from type ‘int’
  v1 = _mm256_FMSUB_pd(v1, tau5, _mm256_add_pd(_mm256_FMA_pd(w1, h5, _mm256_mul_pd(z1,h4)), _mm256_FMA_pd(y1, h3, _mm256_mul_pd(x1,h2))));
     ^
src/elpa2_kernels/elpa2_kernels_real_sse-avx_6hv.c:1493:5: error: incompatible types when assigning to type ‘__m256d {aka __vector(4) double}’ from type ‘int’
  t1 = _mm256_FMSUB_pd(t1, tau6, _mm256_FMA_pd(v1, h6, _mm256_add_pd(_mm256_FMA_pd(w1, h5, _mm256_mul_pd(z1,h4)), _mm256_FMA_pd(y1, h3, _mm256_mul_pd(x1,h2)))));
     ^
At top level:
src/elpa2_kernels/elpa2_kernels_real_sse-avx_6hv.c:1202:20: warning: always_inline function might not be inlinable [-Wattributes]
 __forceinline void hh_trafo_kernel_4_AVX_6hv(double* q, double* hh, int nb, int ldq, int ldh, double* scalarprods)
                    ^
src/elpa2_kernels/elpa2_kernels_real_sse-avx_6hv.c:429:20: warning: always_inline function might not be inlinable [-Wattributes]
 __forceinline void hh_trafo_kernel_8_AVX_6hv(double* q, double* hh, int nb, int ldq, int ldh, double* scalarprods)
                    ^
src/elpa2_kernels/elpa2_kernels_real_sse-avx_2hv.c:916:21: warning: always_inline function might not be inlinable [-Wattributes]
  __forceinline void hh_trafo_kernel_4_AVX_2hv(double* q, double* hh, int nb, int ldq, int ldh, double s)
                     ^
src/elpa2_kernels/elpa2_kernels_real_sse-avx_2hv.c:762:21: warning: always_inline function might not be inlinable [-Wattributes]
  __forceinline void hh_trafo_kernel_8_AVX_2hv(double* q, double* hh, int nb, int ldq, int ldh, double s)
                     ^
src/elpa2_kernels/elpa2_kernels_real_sse-avx_2hv.c:528:21: warning: always_inline function might not be inlinable [-Wattributes]
  __forceinline void hh_trafo_kernel_16_AVX_2hv(double* q, double* hh, int nb, int ldq, int ldh, double s)
                     ^
src/elpa2_kernels/elpa2_kernels_real_sse-avx_2hv.c:214:21: warning: always_inline function might not be inlinable [-Wattributes]
  __forceinline void hh_trafo_kernel_24_AVX_2hv(double* q, double* hh, int nb, int ldq, int ldh, double s)
                     ^
Makefile:1566: recipe for target 'src/elpa2_kernels/elpa2_kernels_real_sse-avx_4hv.lo' failed
make[1]: *** [src/elpa2_kernels/elpa2_kernels_real_sse-avx_4hv.lo] Error 1
make[1]: *** Waiting for unfinished jobs....
Makefile:1566: recipe for target 'src/elpa2_kernels/elpa2_kernels_real_sse-avx_6hv.lo' failed
make[1]: *** [src/elpa2_kernels/elpa2_kernels_real_sse-avx_6hv.lo] Error 1
src/elpa2_kernels/elpa2_kernels_complex_sse-avx_1hv.cpp:525:27: warning: always_inline function might not be inlinable [-Wattributes]
 static __forceinline void hh_trafo_complex_kernel_4_AVX_1hv(std::complex<double>* q, std::complex<double>* hh, int nb, int ldq)
                           ^
src/elpa2_kernels/elpa2_kernels_complex_sse-avx_1hv.cpp:380:27: warning: always_inline function might not be inlinable [-Wattributes]
 static __forceinline void hh_trafo_complex_kernel_8_AVX_1hv(std::complex<double>* q, std::complex<double>* hh, int nb, int ldq)
                           ^
src/elpa2_kernels/elpa2_kernels_complex_sse-avx_1hv.cpp:185:28: warning: always_inline function might not be inlinable [-Wattributes]
  static __forceinline void hh_trafo_complex_kernel_12_AVX_1hv(std::complex<double>* q, std::complex<double>* hh, int nb, int ldq)
                            ^
src/elpa2_kernels/elpa2_kernels_complex_sse-avx_2hv.cpp:1317:27: warning: always_inline function might not be inlinable [-Wattributes]
 static __forceinline void hh_trafo_complex_kernel_2_AVX_2hv(std::complex<double>* q, std::complex<double>* hh, int nb, int ldq, int ldh, std::complex<double> s)
                           ^
src/elpa2_kernels/elpa2_kernels_complex_sse-avx_2hv.cpp:1044:27: warning: always_inline function might not be inlinable [-Wattributes]
 static __forceinline void hh_trafo_complex_kernel_4_AVX_2hv(std::complex<double>* q, std::complex<double>* hh, int nb, int ldq, int ldh, std::complex<double> s)
                           ^
src/elpa2_kernels/elpa2_kernels_complex_sse-avx_2hv.cpp:691:27: warning: always_inline function might not be inlinable [-Wattributes]
 static __forceinline void hh_trafo_complex_kernel_6_AVX_2hv(std::complex<double>* q, std::complex<double>* hh, int nb, int ldq, int ldh, std::complex<double> s)
                           ^
src/elpa2_kernels/elpa2_kernels_complex_sse-avx_2hv.cpp:258:27: warning: always_inline function might not be inlinable [-Wattributes]
 static __forceinline void hh_trafo_complex_kernel_8_AVX_2hv(std::complex<double>* q, std::complex<double>* hh, int nb, int ldq, int ldh, std::complex<double> s)
                           ^
make[1]: Leaving directory '/oc/home/user/build-files/cp2k-3.0/tools/toolchain/build/elpa-2015.11.001_mt'
Makefile:1110: recipe for target 'all' failed
make: *** [all] Error 2


More information about the CP2K-user mailing list