Hi everyone, I am having an error while compiling the cp2k and the error shows this<div><br /></div><div>usr/bin/ld: /home/batmen/cp2k/tools/toolchain/install/scalapack-2.2.1/lib/libscalapack.a(clarnv.f.o): relocation R_X86_64_32S against `.rodata' can not be used when making a PIE object; recompile with -fPIE<br />/usr/bin/ld: failed to set dynamic section sizes: bad value<br />collect2: error: ld returned 1 exit status<br />make[3]: *** [/home/batmen/cp2k/obj/local/psmp/all.dep:166: /home/batmen/cp2k/exe/local/dbt_tas_unittest.psmp] Error 1<br />make[3]: *** Waiting for unfinished jobs....<br />make[2]: *** [/home/batmen/cp2k/Makefile:146: all] Error 2<br />make[1]: *** [/home/batmen/cp2k/Makefile:135: popt] Error 2<br />make: *** [Makefile:123: all] Error 2<br /></div><div><br /></div><div>This is the last line please tell how to solve this</div><div>Thanks in advance</div>
<p></p>
-- <br />
You received this message because you are subscribed to the Google Groups "cp2k" group.<br />
To unsubscribe from this group and stop receiving emails from it, send an email to <a href="mailto:cp2k+unsubscribe@googlegroups.com">cp2k+unsubscribe@googlegroups.com</a>.<br />
To view this discussion visit <a href="https://groups.google.com/d/msgid/cp2k/38f8aa79-9210-42aa-b910-601d32f952b1n%40googlegroups.com?utm_medium=email&utm_source=footer">https://groups.google.com/d/msgid/cp2k/38f8aa79-9210-42aa-b910-601d32f952b1n%40googlegroups.com</a>.<br />