[CP2K-user] Hi...while instaling cp2k via cygwin getting error

vasanth kumar vasan... at gmail.com
Tue Oct 13 09:11:14 UTC 2020


I am unable to install cp2k in my windows-10 , it showing the
error....copied below

VASANTH at LAPTOP-UL1N39OG ~/cp2k-7.1/makefiles
$ make ARCH=Cygwin-i686-gfortran VERSION=sopt
Discovering programs ...
Removing stale archives for sopt ...
Resolving dependencies for sopt ...
makedep error: Module filename format must be either of "lower", "upper",
or "no".
make[2]: *** [/home/VASANTH/cp2k-7.1/makefiles/Makefile:389: makedep] Error
make[1]: *** [/home/VASANTH/cp2k-7.1/makefiles/Makefile:118: sopt] Error 2
make: *** [makefile:113: all] Error 2

pl suggest the solution

thanks in advance

With Regards

Dr. V. Vasantha Kumar
Assoc. Prof. of Physics
Vignan Institute of Technology and Science
-------------- next part --------------
An HTML attachment was scrubbed...
URL: <https://lists.cp2k.org/archives/cp2k-user/attachments/20201013/0aeac33e/attachment.htm>
-------------- next part --------------
A non-text attachment was scrubbed...
Name: makefile error.png
Type: image/png
Size: 24688 bytes
Desc: not available
URL: <https://lists.cp2k.org/archives/cp2k-user/attachments/20201013/0aeac33e/attachment.png>

More information about the CP2K-user mailing list