cp2k 3.0 installation error

SaeeD PourasaD saeedp... at gmail.com
Thu Jan 7 16:07:47 CET 2016


Dear Rizwan , 

I want to install cp2k in my system and I get this error , can you please 
let me know how you could solve this problem ?

On Wednesday, January 6, 2016 at 2:38:17 PM UTC+9, Rizwan Nabi wrote:
>
> hi everybody 
> I am trying to install cp2k-3.0 version in my system but I am getting 
> following error. Can anybody help me to solve this error?
>
>
> Included at /home/rajaraman/cp2k-3.0/src/dbcsr/data/dbcsr_ptr_util.F:160:
>
>     r2p(1:d1,1:d2) => r1p(1:d1*d2)
>     1
> Error: Pointer bounds remapping at (1) is not yet implemented in gfortran
> /home/rajaraman/cp2k-3.0/src/dbcsr/data/dbcsr_ptr_util_s.f90:322.4:
>     Included at 
> /home/rajaraman/cp2k-3.0/src/dbcsr/data/dbcsr_ptr_util.F:159:
>
>     r2p(1:d1,1:d2) => r1p(1:d1*d2)
>     1
> Error: Pointer bounds remapping at (1) is not yet implemented in gfortran
> /home/rajaraman/cp2k-3.0/src/dbcsr/data/dbcsr_ptr_util_z.f90:322.4:
>     Included at 
> /home/rajaraman/cp2k-3.0/src/dbcsr/data/dbcsr_ptr_util.F:158:
>
>     r2p(1:d1,1:d2) => r1p(1:d1*d2)
>     1
> Error: Pointer bounds remapping at (1) is not yet implemented in gfortran
> /home/rajaraman/cp2k-3.0/src/dbcsr/data/dbcsr_ptr_util_d.f90:322.4:
>     Included at 
> /home/rajaraman/cp2k-3.0/src/dbcsr/data/dbcsr_ptr_util.F:157:
>
>     r2p(1:d1,1:d2) => r1p(1:d1*d2)
>     1
> Error: Pointer bounds remapping at (1) is not yet implemented in gfortran
> /home/rajaraman/cp2k-3.0/src/dbcsr/data/dbcsr_ptr_util_l.f90:322.4:
>     Included at 
> /home/rajaraman/cp2k-3.0/src/dbcsr/data/dbcsr_ptr_util.F:156:
>
>     r2p(1:d1,1:d2) => r1p(1:d1*d2)
>     1
> Error: Pointer bounds remapping at (1) is not yet implemented in gfortran
> /home/rajaraman/cp2k-3.0/src/dbcsr/data/dbcsr_ptr_util_i.f90:322.4:
>     Included at 
> /home/rajaraman/cp2k-3.0/src/dbcsr/data/dbcsr_ptr_util.F:155:
>
>     r2p(1:d1,1:d2) => r1p(1:d1*d2)
>     1
> Error: Pointer bounds remapping at (1) is not yet implemented in gfortran
> make[3]: *** [dbcsr_ptr_util.o] Error 1
> make[3]: *** Waiting for unfinished jobs....
> /home/rajaraman/cp2k-3.0/src/pw/fft/fftw3_lib.F:450: error: fftw3.f: No 
> such file or directory
> /home/rajaraman/cp2k-3.0/src/pw/fft/fftw3_lib.F:1013.40:
>
>               zout,0,io,DO,FFTW_BACKWARD,fftw_plan_type)
>                                         1
> Error: Symbol 'fftw_backward' at (1) has no IMPLICIT type
> /home/rajaraman/cp2k-3.0/src/pw/fft/fftw3_lib.F:958.39:
>
>          fftw_plan_type = FFTW_ESTIMATE
>                                        1
> Error: Symbol 'fftw_estimate' at (1) has no IMPLICIT type
> /home/rajaraman/cp2k-3.0/src/pw/fft/fftw3_lib.F:964.41:
>
>          fftw_plan_type = FFTW_EXHAUSTIVE
>                                          1
> Error: Symbol 'fftw_exhaustive' at (1) has no IMPLICIT type
> /home/rajaraman/cp2k-3.0/src/pw/fft/fftw3_lib.F:1010.39:
>
>               zout,0,io,DO,FFTW_FORWARD,fftw_plan_type)
>                                        1
> Error: Symbol 'fftw_forward' at (1) has no IMPLICIT type
> /home/rajaraman/cp2k-3.0/src/pw/fft/fftw3_lib.F:960.38:
>
>          fftw_plan_type = FFTW_MEASURE
>                                       1
> Error: Symbol 'fftw_measure' at (1) has no IMPLICIT type
> /home/rajaraman/cp2k-3.0/src/pw/fft/fftw3_lib.F:962.38:
>
>          fftw_plan_type = FFTW_PATIENT
>                                       1
> Error: Symbol 'fftw_patient' at (1) has no IMPLICIT type
> /home/rajaraman/cp2k-3.0/src/pw/fft/fftw3_lib.F:631.33:
>
>     fft_direction = FFTW_BACKWARD
>                                  1
> Error: Symbol 'fftw_backward' at (1) has no IMPLICIT type
> /home/rajaraman/cp2k-3.0/src/pw/fft/fftw3_lib.F:613.39:
>
>          fftw_plan_type = FFTW_ESTIMATE
>                                        1
> Error: Symbol 'fftw_estimate' at (1) has no IMPLICIT type
> /home/rajaraman/cp2k-3.0/src/pw/fft/fftw3_lib.F:619.41:
>
>          fftw_plan_type = FFTW_EXHAUSTIVE
>                                          1
> Error: Symbol 'fftw_exhaustive' at (1) has no IMPLICIT type
> /home/rajaraman/cp2k-3.0/src/pw/fft/fftw3_lib.F:629.32:
>
>     fft_direction = FFTW_FORWARD
>                                 1
> Error: Symbol 'fftw_forward' at (1) has no IMPLICIT type
> /home/rajaraman/cp2k-3.0/src/pw/fft/fftw3_lib.F:615.38:
>
>          fftw_plan_type = FFTW_MEASURE
>                                       1
> Error: Symbol 'fftw_measure' at (1) has no IMPLICIT type
> /home/rajaraman/cp2k-3.0/src/pw/fft/fftw3_lib.F:617.38:
>
>          fftw_plan_type = FFTW_PATIENT
>                                       1
> Error: Symbol 'fftw_patient' at (1) has no IMPLICIT type
> /home/rajaraman/cp2k-3.0/src/pw/fft/fftw3_lib.F:468.57:
>
>                               FFTW_FORWARD, FFTW_ESTIMATE, guru_supported)
>                                                          1
> Error: Symbol 'fftw_estimate' at (1) has no IMPLICIT type
> /home/rajaraman/cp2k-3.0/src/pw/fft/fftw3_lib.F:468.42:
>
>                               FFTW_FORWARD, FFTW_ESTIMATE, guru_supported)
>                                           1
> Error: Symbol 'fftw_forward' at (1) has no IMPLICIT type
> make[3]: *** [fftw3_lib.o] Error 1
> make[2]: *** [all] Error 2
> make[1]: *** [popt] Error 2
> make: *** [all] Error 2
> [rajaraman at triplet makefiles]$ 
> [rajaraman at triplet makefiles]$ 
>
>
>
> Regards 
>
> Rizwan 
> From cool Mumbai
>
>
-------------- next part --------------
An HTML attachment was scrubbed...
URL: <https://lists.cp2k.org/archives/cp2k-user/attachments/20160107/8d72e0d7/attachment.html>


More information about the CP2K-user mailing list