[CP2K:918] CP2K compilation on p5series AIX 5.3

Teodoro Laino teodor... at gmail.com
Mon Apr 7 16:57:21 CEST 2008


hi X,

please post your arch file ?

Teo

On 7 Apr 2008, at 16:49, CompilationAIX wrote:

>
> hello,
>
> I'm trying to compile today's nightly snapshot of CP2K and I need some
> help :
>
> after a while, some errors appears :
>
> "/p5cecic/home/cp2k-new/cp2k/makefiles/../src/pint_types.F", line
> 2373.49: 1514-084 (S) Identifier pint_env is being declared with type
> name pint_env_type which has not been defined in a derived type
> definition.
>
> (a lot of screens of that)
>
> and it finally ends like that :
>
> "/p5cecic/home/cp2k-new/cp2k/makefiles/../src/pint_types.F", 1516-036
> (S) Entity cp_fatal_level has undefined type.
> "/p5cecic/home/cp2k-new/cp2k/makefiles/../src/pint_types.F", 1516-036
> (S) Entity cp_warning_level has undefined type.
> "/p5cecic/home/cp2k-new/cp2k/makefiles/../src/pint_types.F", 1516-036
> (S) Entity timestop has undefined type.
> "/p5cecic/home/cp2k-new/cp2k/makefiles/../src/pint_types.F", 1516-036
> (S) Entity cp_failure_level has undefined type.
> ** pint_types   === End of Compilation 1 ===
> 1501-511  Compilation failed for file pint_types.F.
> gmake[1]: *** [pint_types.o] Error 1
> gmake[1]: *** Waiting for unfinished jobs....
> gmake[1]: *** [md_run.o] Error 251
> gmake[1]: *** [geo_opt.o] Error 251
> gmake[1]: *** [cell_opt.o] Error 251
> gmake: *** [build] Interrupt
>
> configuration we use :
> IBM pSeries 510 Power5 with AIX 5.3.3 (5300-07)
> Compilers :   xlC 7.0.0.1, xlF 9.1.0.4
> Libraries :	PPE 4.2.2.1
>
> if you have an idea ?
>
> thanks for your help :-)
>
> >




More information about the CP2K-user mailing list