CP2K compilation errors

Eric Shamay eric.... at gmail.com
Thu May 24 00:36:22 CEST 2007


It's my hope that this group is also meant for posting problems
related to installation/compilation of cp2k. If not, please excuse the
post!

I'm in the midst of an installation of the popt for the Linux-ia64-
intel architecture. I've been able to compile without error previously
(about 6 months ago), but a newer version results in an error that
reads as follows:

<snippet>
mpif90 -FR -c -O2 -Vaxlib -tpp2 xc_pot_saop.f90
mpif90 -FR -c -O2 -Vaxlib -tpp2 constraint.f90
mpif90 -FR -c -O2 -Vaxlib -tpp2 qs_wf_history_methods.f90
mpif90 -FR -c -O2 -Vaxlib -tpp2 qs_environment_methods.f90
mpif90 -FR -c -O2 -Vaxlib -tpp2 harris_force.f90
mpif90 -FR -c -O2 -Vaxlib -tpp2 harris_functional.f90
mpif90 -FR -c -O2 -Vaxlib -tpp2 qs_electric_field_gradient.f90
mpif90 -FR -c -O2 -Vaxlib -tpp2 topology.f90
fortcom: Severe: **Internal compiler error: segmentation violation
signal raised** Please report this error along with the circumstances
in which it occurred in a Software Problem Report.  Note: File and
line given may not be explicit cause of this error.

compilation aborted for mc_types.f90 (code 3)
make[2]: *** [mc_types.o] Error 3
make[2]: *** Waiting for unfinished jobs....
rm cp2k.f90
make[2]: Leaving directory `/mnt/netapp/home/users/eshamay/tmp/cp2k/
obj/Linux-ia64-intel/popt'
make[1]: *** [build] Error 2
make[1]: Leaving directory `/mnt/netapp/home/users/eshamay/tmp/cp2k/
makefiles'
make: *** [popt] Error 2
</snippet>

It seems to keep hanging on the compilation of mc_types.f90. Does
anyone have any advice for this particular build? Should I try to pull
an older version of that file from the CVS and recompile? Any help
would be greatly appreciated.

Thanks,
~Eric Shamay




More information about the CP2K-user mailing list